*HEADING
Thick plate rolling: 3-Dimensional, ABAQUS/Explicit
SECTION CONTROLS USED (KINEMA=ORTHOGONAL, HOURGLASS=COMBINED)
*RESTART,WRITE,NUM=4
*PREPRINT,MODEL=YES,HISTORY=YES,CONTACT=YES
***********************************************
*NODE
** Bar
*NGEN,NSET=BOT1
*NGEN,NSET=TOP1
*NGEN,NSET=BOT2
*NGEN,NSET=TOP2
*NFILL,NSET=ZSYMM
BOT1,TOP1,8,100
*NFILL,NSET=SIDE
BOT2,TOP2,8,100
*NFILL,NSET=BAR
ZSYMM,SIDE,8,3000
*NSET,NSET=BOTTOM,GEN
**
** Roller, Radius = .170 m
**
*NODE
** Reference node
** Nodes forming roll
**
*NGEN,NSET=ROLL1,LINE=C
*NGEN,NSET=ROLL2,LINE=C
**
***********************************************
***** Bar
**
*ELEMENT,TYPE=C3D8R,ELSET=METAL
*ELGEN,ELSET=METAL
**
*ELSET,ELSET=TOP,GEN
*ELSET,ELSET=BACK,GEN
*ELSET,ELSET=SIDE,GEN
**
*SOLID SECTION,ELSET=METAL,MAT=C15, CONTROL=B
1.,
*SECTION CONTROLS, KINEMA=ORTHOGONAL, HOURGLASS=COMBINED, NAME=B
**
*MATERIAL,NAME=C15
*ELASTIC
1.5E11,.3
*PLASTIC
168.72E06,0
219.33E06,0.1
272.02E06,0.2
308.53E06,0.3
337.37E06,0.4
361.58E06,0.5
382.65E06,0.6
401.42E06,0.7
*DENSITY
7850,
**
***********************************************
****   Roll
**
*ELEMENT,TYPE=R3D4,ELSET=ROLLER
*ELGEN,ELSET=ROLLER
**
*INITIAL CONDITIONS,TYPE=VELOCITY
BAR,1,1.0367
**
*RIGID BODY,ELSET=ROLLER,REF NODE=30000
**
*SURFACE INTERACTION,NAME=FRICT
*FRICTION
 0.3,
**
*STEP
*DYNAMIC,EXPLICIT
,0.089286
*FIXED MASS SCALING,FACTOR=2758.5,ELSET=METAL
**
*BOUNDARY
BOTTOM,2,2
ZSYMM,ZSYMM
30000,1,5
**
*BOUNDARY,TYPE=VELOCITY
**30000,6,6,330.0
30000,6,6,6.2832
**
*CONTACT
*CONTACT INCLUSIONS,ALL ELEMENT BASED
*CONTACT PROPERTY ASSIGNMENT
,,FRICT
**
**
*FILE OUTPUT,TIMEMARKS=YES,NUM=1
*EL FILE, ELSET=QA_TEST
PEEQ,
*NODE FILE, NSET=QA_TEST
U,
*ENERGY FILE
*****
*ELSET, ELSET=QA_TEST
SIDE,
*NSET, NSET=QA_TEST
SIDE,
*OUTPUT, FIELD, TIME MARKS=YES, NUMBER INTERVAL=1
*ELEMENT OUTPUT, ELSET=QA_TEST
PEEQ,
*NODE OUTPUT, NSET=QA_TEST
U,
*OUTPUT, HIST, FREQ=9999
*ENERGY OUTPUT, VAR=PRESELECT
****
*OUTPUT, FIELD, TIME MARKS=YES, NUMBER INTERVAL=1
*ELEMENT OUTPUT
PEEQ,
*NODE OUTPUT
U,
******
*END STEP