*HEADING
Thick plate rolling: Plane Strain, ABAQUS/Explicit
(Analytical rigid surfaces)
*RESTART,WRITE,NUM=10
**
*NODE
** Bar
**
*NGEN,NSET=BOTTOM
*NGEN,NSET=TOP
**
*NFILL,NSET=BAR
BOTTOM,TOP,8,50
**
***** Bar
**
*ELEMENT,TYPE=CPE6M,ELSET=METAL
**
*ELSET,ELSET=TOP,GEN
**
*SOLID SECTION,ELSET=METAL,MAT=C15,CONTROL=B
1.,
*SECTION CONTROLS,NAME=B
*MATERIAL,NAME=C15
*ELASTIC
1.5E11,.3
*PLASTIC
168.72E06,0
219.33E06,0.1
272.02E06,0.2
308.53E06,0.3
337.37E06,0.4
361.58E06,0.5
382.65E06,0.6
401.42E06,0.7
*DENSITY
7.85E3,
**
** Node for rigid surface
*NODE
*INITIAL CONDITIONS,TYPE=VELOCITY
BAR,1,1.0367
**
**
*SURFACE, TYPE=SEGMENTS,NAME=ROLLER
START,   0.040900,   0.015000
CIRCL,  -.129100,   0.185000 ,  0.0409 ,  0.185
*SURFACE,TYPE=ELEMENT, NAME=SURF1
TOP,S1
*RIGID BODY, REF NODE=10000, ANALYTICAL SURFACE =ROLLER
*STEP
*DYNAMIC,EXPLICIT
,0.089286
*FIXED MASS SCALING,FACTOR=2758.5,ELSET=METAL
**
** Roller, Radius = .170 m
**
*BOUNDARY
BOTTOM,2,2
10000,1,2
**
*BOUNDARY,TYPE=VELOCITY
10000,6,6,6.2832
**
*SURFACE INTERACTION,NAME=FRICT
*FRICTION
 0.3,
*CONTACT PAIR,INTERACTION=FRICT
SURF1,ROLLER
**
**
**
*FILE OUTPUT,TIMEMARKS=YES,NUM=1
*EL FILE, ELSET=TOP
PEEQ,
*NODE FILE, NSET=QA_TEST
U,
*ENERGY FILE
*****
*ELSET, ELSET=QA_TEST
TOP,
*NSET, NSET=QA_TEST
TOP,
*OUTPUT, FIELD, TIME MARKS=YES, NUMBER INTERVAL=1
*ELEMENT OUTPUT, ELSET=TOP
PEEQ,
*NODE OUTPUT, NSET=QA_TEST
U,
*OUTPUT, HIST, FREQ=9999
*ENERGY OUTPUT, VAR=PRESELECT
****
*OUTPUT, FIELD, TIME MARKS=YES, NUMBER INTERVAL=1
*ELEMENT OUTPUT
PEEQ,
*NODE OUTPUT
U,
******
*END STEP
**