*HEADING
QUENCHING OF AN INFINITE PLATE WITH /EXPLICIT  [CAX4RT]
**
** See ch. 1.6.4 of ABAQUS/Benchmarks Manual
**
*NODE
*NGEN,NSET=ALL
*NSET,NSET=RAXIS
*NSET,NSET=ZAXIS,GENERATE
*NSET,NSET=TOP
*NSET,NSET=SIDE,GENERATE
*NSET,NSET=SIDE1,GENERATE
*ELEMENT,TYPE=CAX4RT
*ELGEN,ELSET=ALL
*ELSET,ELSET=EOUT
*NSET,NSET=QA_TEST
ALL
*SOLID SECTION,MATERIAL=MAT,ELSET=ALL
*MATERIAL,NAME=MAT
*ELASTIC
3.E7,.3
*PLASTIC
3.6E4,.0
3.6E4,.0,250.
4.5E3,.0,2000.
*EXPANSION,ZERO=70.
7.5E-6,
*SPECIFIC HEAT
.1431,
*DENSITY
.2829,
*CONDUCTIVITY
7.872E-4,
*INELASTIC HEAT FRACTION
*BOUNDARY
RAXIS,2
ZAXIS,1
*EQUATION
SIDE1,1,1., 101,1,-1.
*INITIAL CONDITIONS,TYPE=TEMPERATURE
ALL,1900.
*STEP
*DYNAMIC TEMPERATURE-DISPLACEMENT, EXPLICIT
*FIXED MASS SCALING, ELSET=ALL, FACTOR=3.E6
*FILM
20,F3,70.,6.559E-5
**************************
*FILE OUTPUT, NUM=1
*NODE FILE,NSET=ALL
NT,U
**************************
*OUTPUT, FIELD,NUM=1
*NODE OUTPUT,NSET=QA_TEST
NT,U
*ELEMENT OUTPUT
S,
**************************
***OUTPUT, HISTORY, TIME INTERVAL=5e3
***ELEMENT OUTPUT, ELSET=EOUT
**S11,
***************
*OUTPUT, HISTORY, TIME INTERVAL=10e4
*ENERGY OUTPUT,VAR=ALL
*************************
*END STEP