*HEADING
QUENCHING OF AN INFINITE PLATE WITH /EXPLICIT  [CAX3T]
**
** See ch. 1.6.4 of ABAQUS/Benchmarks Manual
**
*NODE, NSET=ALL
*ELEMENT, TYPE=CAX3T, ELSET=ALL
*NSET, NSET=RAXIS
*ELSET, ELSET=RAXIS
*NSET, NSET=ZAXIS
*ELSET, ELSET=ZAXIS
*NSET, NSET=SIDE
*NSET, NSET=SIDE1
*ELSET, ELSET=SIDE
*NSET, NSET=TOP
*ELSET, ELSET=TOP
*ELSET, ELSET=EOUT
TOP, RAXIS
*NSET,NSET=QA_TEST
ALL
*SOLID SECTION,MATERIAL=MAT,ELSET=ALL
*MATERIAL,NAME=MAT
*ELASTIC
3.E7,.3
*PLASTIC
3.6E4,.0
3.6E4,.0,250.
4.5E3,.0,2000.
*EXPANSION,ZERO=70.
7.5E-6,
*SPECIFIC HEAT
.1431,
*DENSITY
.2829,
*CONDUCTIVITY
7.872E-4,
*INELASTIC HEAT FRACTION
*BOUNDARY
RAXIS,2
ZAXIS,1
*EQUATION
SIDE1,1,1.,2,1,-1.
*INITIAL CONDITIONS,TYPE=TEMPERATURE
ALL,1900.
*STEP
*DYNAMIC TEMPERATURE-DISPLACEMENT, EXPLICIT
*FIXED MASS SCALING, ELSET=ALL, FACTOR=2.5E6
*FILM
21,F2,70.,6.559E-5
**************************
*FILE OUTPUT, NUM=1
*NODE FILE,NSET=ALL
NT,U
**************************
*OUTPUT, FIELD,NUM=1
*NODE OUTPUT,NSET=QA_TEST
NT,U
*ELEMENT OUTPUT
S,
**************************
***OUTPUT, HISTORY, TIME INTERVAL=1e3
***ELEMENT OUTPUT, ELSET=EOUT
**S11,
***************
*OUTPUT, HISTORY, TIME INTERVAL=0.4e5
*ENERGY OUTPUT,VAR=ALL
*************************
*END STEP