*HEADING
QUENCHING OF AN INFINITE PLATE WITH /EXPLICIT  [C3D8RT]
**
** See ch. 1.6.4 of ABAQUS/Benchmarks Manual
**
*NODE
*NGEN,NSET=ALL
*NSET,NSET=RAXIS
*NSET,NSET=ZAXIS,GENERATE
*NSET,NSET=TOP
*NSET,NSET=SIDE,GENERATE
*NSET,NSET=SIDE1,GENERATE
*NSET,NSET=BACK,GEN
*NSET,NSET=FRONT1,GEN
*ELEMENT,TYPE=C3D8RT
*ELGEN,ELSET=ALL
*ELSET,ELSET=EOUT
*NSET,NSET=QA_TEST
ALL
*SOLID SECTION,MATERIAL=MAT,ELSET=ALL
*MATERIAL,NAME=MAT
*ELASTIC
3.E7,.3
*PLASTIC
3.6E4,.0
3.6E4,.0,250.
4.5E3,.0,2000.
*EXPANSION,ZERO=70.
7.5E-6,
*SPECIFIC HEAT
.1431,
*DENSITY
.2829,
*CONDUCTIVITY
7.872E-4,
*INELASTIC HEAT FRACTION
*EQUATION
SIDE1,1,1., 101,1,-1.
FRONT1,3,1.,1001,3,-1.
**
*INITIAL CONDITIONS,TYPE=TEMPERATURE
ALL,1900.
*BOUNDARY
RAXIS,2
ZAXIS,1
back,3,3
*STEP
*DYNAMIC TEMPERATURE-DISPLACEMENT, EXPLICIT
*FIXED MASS SCALING, ELSET=ALL, FACTOR=4.E6
*FILM
20,F5,70.,6.559E-5
*************************
*FILE OUTPUT, NUM=1
*NODE FILE
NT,U
**************************
*OUTPUT, FIELD,NUM=1
*NODE OUTPUT,NSET=QA_TEST
NT,U
*ELEMENT OUTPUT
S,
*************************
***OUTPUT, HISTORY, TIME INTERVAL=1e3
***ELEMENT OUTPUT, ELSET=EOUT
**S11,
**************
*OUTPUT, HISTORY, TIME INTERVAL=0.4e5
*ENERGY OUTPUT,VAR=ALL
*************************
*END STEP