*HEADING
QUENCHING OF AN INFINITE PLATE WITH /STANDARD  [CAX4T]
**
** See ch. 1.6.4 of ABAQUS/Benchmarks Manual
**
*NODE
*NGEN,NSET=ALL
*NSET,NSET=RAXIS
*NSET,NSET=ZAXIS,GENERATE
*NSET,NSET=TOP
*NSET,NSET=SIDE,GENERATE
*NSET,NSET=SIDE1,GENERATE
*ELEMENT,TYPE=CAX4T
*ELGEN,ELSET=ALL
*ELSET,ELSET=EOUT
*NSET,NSET=QA_TEST
ALL
*SOLID SECTION,MATERIAL=MAT,ELSET=ALL
*MATERIAL,NAME=MAT
*ELASTIC
3.E7,.3
*PLASTIC
3.6E4,.0
3.6E4,.0,250.
4.5E3,.0,2000.
*EXPANSION,ZERO=70.
7.5E-6,
*SPECIFIC HEAT
.1431,
*DENSITY
.2829,
*CONDUCTIVITY
7.872E-4,
*INELASTIC HEAT FRACTION
*BOUNDARY
RAXIS,2
ZAXIS,1
*EQUATION
SIDE1,1,1., 101,1,-1.
*INITIAL CONDITIONS,TYPE=TEMPERATURE
ALL,1900.
*STEP,INC=500
*COUPLED TEMPERATURE-DISPLACEMENT,DELTMX=10
 20., 10e4, 0.5
*SOLUTION TECHNIQUE, TYPE=SEPARATED
*FILM
20,F3,70.,6.559E-5
*NODE FILE,NSET=ALL,FREQ=500
NT,U
*OUTPUT, FIELD, FREQ=500
*NODE OUTPUT,NSET=QA_TEST
NT,U
*ELEMENT OUTPUT
S,
*OUTPUT, HISTORY, FREQ=1
*ELEMENT OUTPUT,ELSET=EOUT
S,
*END STEP