*HEADING
QUENCHING OF AN INFINITE PLATE
*NODE
*NGEN,NSET=ALL
*NSET,NSET=RAXIS
*NSET,NSET=ZAXIS,GENERATE
*NSET,NSET=TOP
*NSET,NSET=SIDE,GENERATE
*NSET,NSET=SIDE1,GENERATE
*ELEMENT,TYPE=CAX8R
*ELGEN,ELSET=ALL
*ELSET,ELSET=PR
*SOLID SECTION,MATERIAL=MAT,ELSET=ALL
*MATERIAL,NAME=MAT
*ELASTIC
3.E7,.3
*PLASTIC
3.6E4,.0
3.6E4,.0,250.
4.5E3,.0,2000.
*EXPANSION,ZERO=70.
7.5E-6,
*EQUATION
SIDE1,1,1., 201,1,-1.
*INITIAL CONDITIONS,TYPE=TEMPERATURE
ALL,1900.
*STEP,INC=100
*STATIC
10.,9.616E4
*BOUNDARY
RAXIS,2
ZAXIS,1
*TEMPERATURE,FILE=quenchplate_dc2d8.odb
*EL PRINT,FREQUENCY=5
COORD,S
E,
PE,
*EL FILE,ELSET=PR
S,PE
*OUTPUT,FIELD
*ELEMENT OUTPUT,ELSET=PR
S,PE
*NODE PRINT,FREQUENCY=5
*END STEP