*HEADING
: Submodel from pgcs8sfd [CPS8]
*NODE,NSET=NALL
*NGEN,NSET=NL
*NGEN,NSET=NR
*NFILL
NL,NR,8,100
*ELEMENT,TYPE=CPS8,ELSET=EALL
*ELGEN,ELSET=EALL
*ELSET,ELSET=E1
*SOLID SECTION,MATERIAL=A1, ELSET=EALL
1.0,
*MATERIAL,NAME=A1
*ELASTIC,TYPE=ISOTROPIC
30.0E6,0.3
*BOUNDARY
NL,1,2
*ELSET,ELSET=RIGHT
*SURFACE,NAME=SRIGHT
RIGHT,S2
*SUBMODEL,TYPE=SURFACE
SRIGHT,
*STEP,PERTURBATION
*STATIC
*DSLOAD,SUBMODEL,STEP=3,INC=25
SRIGHT,
*ENERGY FILE
*OUTPUT,FIELD
*NODE OUTPUT
U,
*ELEMENT OUTPUT
S,
*END STEP