*HEADING
: Submodel from pgcg8sks [CPEG4]
*NODE
*NODE
*NGEN,NSET=NL
*NGEN,NSET=NR
*NFILL,NSET=NALL
 NL,NR,6,100
*ELEMENT,TYPE=CPEG4,ELSET=EALL
*ELGEN,ELSET=EALL
*ELSET,ELSET=E1
*ELSET,ELSET=ESUBMODEL,GEN
*SOLID SECTION,MATERIAL=MAT1,ELSET=EALL,REFNODE=998
*MATERIAL,NAME=MAT1
*ELASTIC
 30.E6,0.3
*DENSITY
1.0
*ELSET,ELSET=LOAD
*surface, name=driven
ESUBMODEL,S4
*SUBMODEL, type=surface
 driven,
*BOUNDARY
 998,3,5,0.
*STEP,PERTURBATION
*STATIC
*inertia relief
*DSLOAD,SUBMODEL,STEP=1
 driven
*DLOAD,OP=NEW
 LOAD,P2,-1000000.
*OUTPUT,FIELD
*ELEMENT OUTPUT
S,
*END STEP