*HEADING
: Submodel from pgce4sfs [CPE4]
*NODE
*NGEN,NSET=NL
*NGEN,NSET=NR
*NFILL,NSET=NALL
NL,NR,6,100
*ELEMENT,TYPE=CPE4,ELSET=EALL
*ELGEN,ELSET=EALL
*SOLID SECTION,MATERIAL=MAT1,ELSET=EALL
*MATERIAL,NAME=MAT1
*ELASTIC
30.E6,0.3
*DENSITY
1.0
*ELSET,ELSET=LOAD
*ELSET,ELSET=LEFT,GEN
*NSET,NSET=BOTTOM,GEN
*SURFACE,NAME=SLEFT
LEFT,S4
*SUBMODEL,EXT=0.07,TYPE=SURFACE
SLEFT,
*SUBMODEL,EXT=0.07
NL,
*STEP
*STATIC
0.1,1.
*INERTIA RELIEF
*DSLOAD,SUBMODEL,STEP=1
SLEFT,
*DLOAD,OP=NEW
LOAD,P2,-1000000.
*OUTPUT, FIELD
*ELEMENT OUTPUT
S,
*END STEP