*Heading
 Booker
** Job name: New-Booker-Sept09 Model name: Model-1
** Generated by: Abaqus/CAE 6.10-DEV
*Preprint, echo=NO, model=NO, history=NO, contact=NO
**
** PARTS
**
*Part, name=Part-1
*Node
*Element, type=C3D8RPHT
*Nset, nset=HeatSource
*Elset, elset=HeatSource
*Nset, nset=XY
*Elset, elset=XY
*Nset, nset=YZ
*Elset, elset=YZ
*Nset, nset=_PickedSet15, internal, generate
*Elset, elset=_PickedSet15, internal, generate
*Elset, elset=_Outer_S2, internal
*Elset, elset=_Outer_S3, internal
*Elset, elset=_Outer_S5, internal
*Elset, elset=_Outer_S6, internal
*Elset, elset=_Outer_S4, internal
*Surface, type=ELEMENT, name=Outer
_Outer_S2, S2
_Outer_S3, S3
_Outer_S6, S6
_Outer_S4, S4
_Outer_S5, S5
*Elset, elset=_Symmetry_S1, internal
*Elset, elset=_Symmetry_S2, internal, generate
*Surface, type=ELEMENT, name=Symmetry
_Symmetry_S1, S1
_Symmetry_S2, S2
** Section: Soil
*Solid Section, elset=_PickedSet15, material=Soil
*End Part
**
**
** ASSEMBLY
**
*Assembly, name=Assembly
**
*Instance, name=Part-1-1, part=Part-1
*End Instance
**
*Nset, nset=SYMMETRY, instance=Part-1-1
*Elset, elset=SYMMETRY, instance=Part-1-1
*Nset, nset=FarField, instance=Part-1-1
*Elset, elset=FarField, instance=Part-1-1
*Nset, nset=_PickedSet7, internal, instance=Part-1-1
*Elset, elset=_PickedSet7, internal, instance=Part-1-1, generate
*Nset, nset=FarField_PP_, internal, instance=Part-1-1
*Nset, nset=Nall, internal, instance=Part-1-1,generate
*End Assembly
**
** MATERIALS
**
*Material, name=Soil
*Elastic
60E06., 0.4
*Permeability,specific=9800.0
0.0463e-06
*Expansion
0.3e-06
*conductivity
11.9
*Specific heat
40.0
*Density
1000.0
**Pore fluid properties
*Expansion, pore fluid
0.21e-05
*conductivity, pore fluid
11.9
*Specific heat, pore fluid
40.0
*Density, Pore fluid
1000.0
*Initial conditions, type=ratio
Nall, 1.0
*Initial conditions, type=pore
Nall, 0.0
** ----------------------------------------------------------------
**
** STEP: Step-1
**
*Step, name=Step-1, unsymm=YES, inc=100000
*Soils, consolidation, utol=0.5,deltmx=0.003
**
** BOUNDARY CONDITIONS
**
** Name: PRESSURE Type: Pore pressure
*Boundary
FarField_PP_, 8, 8
FarField_PP_, 11, 11
** Name: SYMMETRY Type: Displacement/Rotation
*Boundary
SYMMETRY, 2, 2
** Name: UX Type: Displacement/Rotation
*Boundary
Part-1-1.YZ, 1, 1
** Name: UZ Type: Displacement/Rotation
*Boundary
Part-1-1.XY, 3, 3
**
** LOADS
**
** Name: BF   Type: Body force
*Dflux
_PickedSet7, BF, 11.58
**
** OUTPUT REQUESTS
**
*Restart, write, frequency=0
**
** FIELD OUTPUT: F-Output-1
**
*Output, field, variable=PRESELECT
*Output,field
*Node output
NT,
POR,
*Element Output
FLVEL,
**
** HISTORY OUTPUT: H-Output-1
**
*Output, history, variable=PRESELECT
*Controls,parameters=field, field=pore fluid pressure
0.75,,1.e-12
*Controls, analysis=discontinuous
*End Step