*Heading
*Node
*Ngen,Nset=Bot
*Ngen,Nset=Top
*Nfill,Nset=Nall
 Bot,Top,4,100
*Nset, Nset=Xfix, Gen
*Nset, Nset=Yfix
*Nset, Nset=Yfix2
*Nset, Nset=Xmove, Gen
*Nset, Nset=Ymove, Gen
*Element,Type=cpe4rht,Elset=Eall
*Elgen,Elset=Eall
*Elset, Elset=Eremov
** Qa_Test_Eall and Qa_Test_Nall needed for ABAQUS QA purposes only
*Elset,Elset=Qa_Test_Eall
 Eall,
*Nset,Nset=Qa_Test_Nall
 Nall,
*Solid Section,Material=Rubber,Elset=Eall
 1.,
*Material,Name=Rubber
*Hyperelastic, N=1
 56.00e4, 14.00e4, 1.43e-7
*Conductivity
 7.872e-04
*Density
 0.2829
*Boundary
 Yfix, 2, 2
 Xfix, 1,1
 Yfix2, 2,2
*Step, Nlgeom
 Compress Elements
*Static
 0.1,1.,0.1,0.1
** Control parameters needed for ABAQUS QA purposes only
*Controls,Parameters=Field
 1.e-6,,,,,1e-10
*Boundary
 Xmove, 1,1 ,-0.1
*Node Print,Freq=999
 U,
 Rf,
*El Print,Freq=999
 E,
 S,
*Node File,Freq=999
 U, Rf
*El File,Freq=999
 E, Ne, S
*Output, Field, Freq=999
*Element Output
 E, S
*Node Output
 Rf, U
*Output, Field, Freq=999
*Element Output, Elset=Qa_Test_Eall
 E, S
*Node Output, Nset=Qa_Test_Nall
 U, Rf
*End Step
*Step, Nlgeom
 Remove Middle Elements
*Static
 1.,1.
*Model Change,Remove,Type=Element
 Eremov,
*Output, Field, Freq=999
*Element Output, Elset=Eall
 E,S
*Node Output, Nset=Nall
 U, Rf
*Output, Field, Freq=0
*Element Output, Elset=Qa_Test_Eall
 E,S
*Node Output, Nset=Qa_Test_Nall
 U, Rf
*End Step
*Step, Nlgeom
 Move Removed Nodes Back In
*Static
 1.,1.
*Boundary
 Ymove, 2,2, 0.0
*End Step
*Step, Nlgeom
 Add Elements Back In Annealed
*Static
 0.1,1.,0.1,0.1
*Model Change,Add,Type=Element
 Eremov,
*Boundary,Op=New
 Yfix, 2, 2
 Xfix, 1,1
 Yfix2, 2,2
 Xmove, 1,1 ,0.1
*Output, Field, Freq=999
*Element Output
 E, S
*Node Output
 Rf, U
*Output, Field, Freq=999
*Element Output, Elset=Qa_Test_Eall
 E, S
*Node Output, Nset=Qa_Test_Nall
 U, Rf
*End Step