*Heading
 :  Cgax8rht Model Change Verification
*Node
*Ngen,Nset=Bot
*Ngen,Nset=Top
*Nfill,Nset=Nall
 Bot,Top,8,100
*Nset, Nset=Lhs, Gen
*Nset, Nset=Rhs, Gen
*Nset,Nset=Nmid,Gen
*Nset, Nset=Pinned
*Element,Type=Cgax8rht,Elset=Eall
*Elgen,Elset=Eall
*Elset,Elset=Erhs
*Elset, Elset=Erem
*Solid Section,Material=Heat,Elset=Eall
 1.,
*Material,Name=Heat
*Elastic
 100.00e4, 0.25
*Expansion
 1.0e-6,
*Density
 .2829,
*Conductivity
 7.872e-4,
*Boundary
 Lhs,11
 Bot, 1, 1
 Pinned, 2, 2
 Nall,5
*Step
 Apply Film Condition To Rhs
*Coupled Temperature-Displacement,Steady State
 1.,1.
*Film
 Erhs,F3,100.,1.
*Node Print
 Rf, U, Nt11
*El Print
 E,
 S,
 Hfl,
*Node File, Freq=99
 U, Nt
*El File, Freq=99
 Hfl, S, E
*Output,Field,Freq=1
*Element Output
 E,S
*Node Output
 U,Rf,Nt
*End Step
*Step
Remove Right Hand Side Elements
*Coupled Temperature-Displacement,Steady State
 1.,1.
*Model Change,Remove,Type=Element
 Erem,
*Boundary,Fixed
 Nmid,11
*End Step
*Step
 Replace Right Hand Side Elements
*Coupled Temperature-Displacement,Steady State
.25,1.
*Boundary,Op=New
 Lhs,11
 Bot, 1, 1
 Pinned, 2, 2
 Nall,5
*Model Change,Add,Type=Element
 Erem,
*Film
 Erhs,F3,200.,1.
*End Step