*HEADING
 :  CGAX6M MODEL CHANGE VERIFICATION, HYPERELASTIC MATERIAL
*NODE,NSET=SHORT1
*NODE,NSET=SHORT2
*NFILL,NSET=SHORT
SHORT1,SHORT2,4,2
*NODE
*NGEN,NSET=RHS
*NGEN,NSET=LHS
*NFILL,NSET=NALL
RHS,LHS,4,100
*NSET, NSET=YFIX, GEN
*NSET, NSET=XFIX
*NSET, NSET=XFIX2
*NSET, NSET=YMOVE, GEN
*NSET, NSET=XMOVE, GEN
*NSET, NSET=XMOVE, GEN
*ELEMENT,TYPE=CGAX6M,ELSET=EALL
*ELGEN,ELSET=EALL
*ELSET, ELSET=EREMOV
*SOLID SECTION,MATERIAL=RUBBER,ELSET=EALL
1.,
*MATERIAL,NAME=RUBBER
*HYPERELASTIC, N=1
56.00E4, 14.00E4, 1.43E-5
*CONDUCTIVITY
1.,
*BOUNDARY
YMOVE, 5, 5
YFIX, 2, 2
YFIX, 5, 5
*INITIAL CONDITIONS, TYPE=TEMPERATURE
NALL,0.0
**
*STEP,NLGEOM
 STEP 1: COMPRESS ELEMENTS
*STATIC
0.1,1.,0.1,0.1
*BOUNDARY
YMOVE, 2,2 ,-0.1
*NODE PRINT,FREQ=999
U,
RF,
*EL PRINT,FREQ=999
E,
S,
*NODE FILE,FREQ=999
U, RF
*EL FILE,FREQ=999
E, NE, S
*END STEP
**
*STEP,NLGEOM
STEP 2: REMOVE MIDDLE ELEMENTS
*STATIC
1.,1.
** CONTROL PARAMETERS NEEDED FOR ABAQUS QA PURPOSES ONLY
*CONTROLS,PARAMETERS=FIELD
1.e-6,,,1.,,1e-10
*MODEL CHANGE,REMOVE,TYPE=ELEMENT
EREMOV,
*END STEP
**
*STEP,NLGEOM
 STEP 3: MOVE TOP EDGE DOWN
*STATIC
1.,1.
*CONTROLS,RESET
*BOUNDARY
XMOVE, 1,1, 0.0
*END STEP
**
*STEP,NLGEOM
 STEP 4: ADD ELEMENTS BACK IN
*STATIC
0.1,1.,0.1,0.1
*MODEL CHANGE,ADD,TYPE=ELEMENT
EREMOV,
*BOUNDARY,OP=NEW
YFIX, 2, 2
YFIX, 5, 5
YMOVE, 2,2 ,0.1
*END STEP