*Heading
** Job name: shellsolidpipe_s4_global Model name: Model-1
**
** PARTS
**
*Part, name=Part-1
*End Part
**
** ASSEMBLY
**
*Assembly, name=Assembly
**
*Instance, name=Part-1-1, part=Part-1
*Node
*Include, Input=pipe_submodel_s4r_global_n.inp
*Element, type=S4R
*Include, Input=pipe_submodel_s4r_global_e.inp
** Region: (Section-2:Picked)
*Elset, elset=_I1, internal, generate
** Section: Section-2
*Shell Section, elset=_I1, material=Material-1
0.001, 5
** Region: (Section-1:Picked)
*Elset, elset=_I2, internal, generate
** Section: Section-1
*Shell Section, elset=_I2, material=Material-1
0.00075, 5
*End Instance
*Nset, nset=YSYMM, internal, instance=Part-1-1
*Nset, nset=Fix, internal, instance=Part-1-1
*Nset, nset=Ref, internal, instance=Part-1-1
*Elset, elset=_PipeLoad_E3, internal, instance=Part-1-1, generate
*Surface, type=ELEMENT, name=PipeLoad
_PipeLoad_E3, E3
*Coupling, constraint name=Constraint-1, ref node = Ref, surface=PipeLoad
*Distributing
*End Assembly
**
** MATERIALS
**
*Material, name=Material-1
*Elastic
 6.9e+10, 0.3
** ----------------------------------------------------------------
**
** STEP: Step-1
**
*Step, name=Step-1
Bend Pipe
*Static
1., 1., 1e-05, 1.
**
** BOUNDARY CONDITIONS
**
*Boundary
 YSYMM, YSYMM
 Fix, 1, 6
** Ref, 1, 1,0.000513482
*Cload
 Ref, 1, 10.
**
** FIELD OUTPUT: F-Output-1
**
*Output, field
*Node Output
U, RF
*Element Output
S,
**
** HISTORY OUTPUT: H-Output-1
**
*Output, history
*Node Output, Nset=Ref
 U,RF
*El Print, freq=0
*Node Print, freq=0
*Node File
 U,
*End Step