*Heading
Solid Submodel
ABAQUS/Standard
** Job name: test1 Model name: Model-1
**
** PARTS
**
*Part, name=PART-1-1
*End Part
**
** ASSEMBLY
**
*Assembly, name=Assembly
**
*Instance, name=PART-1-1-1, part=PART-1-1
*Node
*Include, Input=pipe_submodel_c3d8r_sub_s4r_n.inp
*Element, type=C3D8R
*Include, Input=pipe_submodel_c3d8r_sub_s4r_e.inp
*Nset, nset=CUT
*Nset, nset=NPIPE
*Nset, nset=NPLATE
*Nset, nset=NYSYMM
**
** Add missing nodes (IR-252145)
**
*Nset, nset=NYSYMM
**
*Elset, elset=EALL, generate
*Nset, nset=" ALL NODES", generate
*Elset, elset=_I1, internal, generate
*ELSET,ELSET=test
*NSET,ELSET=test,NSET=test
*NSET,NSET=QA_TEST
test,
** Section: Section-1
*Solid Section, elset=_I1, material=Material-1
1.,
*SUBMODEL,SHELLTOSOLID,SHELLTHICKNESS=0.001
CUT,
*End Instance
*End Assembly
** ----------------------------------------------------------------
**
*Material, name=Material-1
*Elastic
 69.0e+09, 0.3
*DENSITY
2740.,
*BOUNDARY
Assembly.PART-1-1-1.NYSYMM,YSYMM
** STEP: Step-1
**
*Step, name=Step-1
*Dynamic,alpha=0.0
2e-6,2e-4
*BOUNDARY,SUBMODEL,STEP=1
Assembly.PART-1-1-1.CUT
**
** OUTPUT REQUESTS
**
**
** FIELD OUTPUT: F-Output-1
**
*Output, field
*element output,variable=PRESELECT
*node output
rf,
*Output, field,freq=20
*node output,nset=Assembly.PART-1-1-1.QA_TEST
U,
**
** HISTORY OUTPUT: H-Output-1
**
*Output, history, freq=10
*energy output,var=preselect
*node output,nset=Assembly.PART-1-1-1.test
U,V,A
*element output,elset=Assembly.PART-1-1-1.test
S,
MISES,
*End Step