*HEADING
PINCHED CYLINDER WITH DIAPHRAGMS AT ENDS - STRI65 - 10 X 10 MESH
*PREPRINT,ECHO=YES,MODEL=NO,HISTORY=NO
*NODE,NSET=P1
*NGEN,NSET=LOADB
*NGEN,NSET=BND3
*NGEN,NSET=BND2
*NGEN,NSET=BND4
*NFILL,NSET=ALL
BND2,BND4,20
*NMAP,TYPE=CYLINDRICAL,NSET=ALL
*ELEMENT,TYPE=STRI65
*ELGEN,ELSET=EALL
*ELSET,ELSET=PRINT
*TRANSFORM,TYPE=C,NSET=ALL
*SHELL SECTION,ELSET=EALL,MATERIAL=MAT
3.0,
*MATERIAL,NAME=MAT
*ELASTIC
3.0E6,0.3
*BOUNDARY
BND2,YSYMM
BND3,ZSYMM
BND4,YSYMM
LOADB,2
LOADB,1
*STEP
*STATIC
*CLOAD
2001,1,-0.25
*EL PRINT,ELSET=PRINT
*EL FILE,ELSET=PRINT
SF,
*OUTPUT,FIELD
*ELEMENT OUTPUT,ELSET=PRINT
SF,
*NODE FILE,NSET=P1
U,RF
*OUTPUT,FIELD
*NODE OUTPUT,NSET=P1
U,RF
*END STEP