*HEADING
PINCHED CYL. WITH DIAPHRAGMS AT ENDS - STRI3 - 12 X 12 MESH, TYPE 1
*PREPRINT,ECHO=YES,MODEL=NO,HISTORY=NO
*NODE
*NGEN,NSET=LOADB
*NGEN,NSET=BND3
*NGEN,NSET=BND2
*NGEN,NSET=BND4
*NSET,NSET=ALL
LOADB,BND3,BND2,BND4
*NFILL,NSET=ALL
BND2,BND4,24
*NMAP,TYPE=CYLINDRICAL,NSET=ALL
*ELEMENT,TYPE=STRI3
*ELGEN,ELSET=EALL
*ELSET,ELSET=PRINT
*TRANSFORM,TYPE=C,NSET=ALL
*SHELL SECTION,ELSET=EALL,MATERIAL=MAT
3.0,
*MATERIAL,NAME=MAT
*ELASTIC
3.0E6,0.3
*BOUNDARY
BND2,YSYMM
BND3,ZSYMM
BND4,YSYMM
LOADB,2
LOADB,6
LOADB,1
*STEP
*STATIC
*CLOAD
 2401,1,-0.25
*EL PRINT,ELSET=PRINT
 S,
 E,
*EL FILE,ELSET=PRINT
S,E
*OUTPUT,FIELD
*ELEMENT OUTPUT,ELSET=PRINT
S,E
*NODE FILE
U,RF
*OUTPUT,FIELD
*NODE OUTPUT
U,RF
*END STEP