*HEADING
PINCHED CYL. WITH DIAPH. AT ENDS, FINE IRREG. MESH - STRI3 - TYPE 1
*PREPRINT,ECHO=YES,MODEL=NO,HISTORY=NO
*NODE,NSET=P1
*NGEN,NSET=BND1A
*NGEN,NSET=BND1B
*NSET,NSET=BND1
BND1A,BND1B
*NGEN,NSET=BND2
*NGEN,NSET=BND3
*NGEN,NSET=BND4A
*NGEN,NSET=BND4B
*NSET,NSET=BND4
BND4A,BND4B
*NGEN,NSET=NODES1
*NGEN,NSET=NODES2
*NFILL,NSET=ALL
BND2,NODES1,8
NODES2,BND3,8,100
NODES1,BND4A,16
*NMAP,TYPE=CYLINDRICAL,NSET=ALL
*ELEMENT,TYPE=STRI3
*ELGEN,ELSET=EALL
*ELEMENT,TYPE=STRI3
*ELGEN,ELSET=EALL
*ELSET,ELSET=PRINT
*TRANSFORM,TYPE=C,NSET=ALL
*SHELL SECTION,ELSET=EALL,MATERIAL=MAT
3.0,
*MATERIAL,NAME=MAT
*ELASTIC
3.0E6,0.3
*BOUNDARY
BND2,YSYMM
BND1,ZSYMM
BND4,YSYMM
BND3,2
BND3,6
BND3,1
*MPC
TIE,1709,1608
TIE,1809,1607
TIE,1909,1606
TIE,2009,1605
TIE,2109,1604
TIE,2209,1603
TIE,2309,1602
TIE,2409,1601
*STEP
*STATIC
*CLOAD
25,1,-0.25
*EL PRINT,ELSET=PRINT
*EL FILE,ELSET=PRINT
S,E
*OUTPUT,FIELD
*ELEMENT OUTPUT,ELSET=PRINT
S,E
*NODE FILE,NSET=P1
U,RF
*OUTPUT,FIELD
*NODE OUTPUT,NSET=P1
U,RF
*END STEP