*HEADING
 PINCHED CYL. WITH DIAPH. AT ENDS - FINE IRREGULAR MESH - SC8R,TYPE 2
*PREPRINT,ECHO=YES,MODEL=NO,HISTORY=NO
*NODE,NSET=P1
*NGEN,NSET=BND1A
*NGEN,NSET=BND1B
*NSET,NSET=BND1
BND1A,BND1B
*NGEN,NSET=BND2
*NSET,NSET=BND22,GENERATE
*NGEN,NSET=BND3
*NGEN,NSET=BND4A
*NGEN,NSET=BND4B
*NSET,NSET=BND4
BND4A,BND4B
*NGEN,NSET=NODES1
*NGEN,NSET=NODES2
*NFILL,NSET=ALL
BND2,NODES1,8
NODES2,BND3,8,100
NODES1,BND4A,16
*NMAP,TYPE=CYLINDRICAL,NSET=ALL
*ELEMENT,TYPE=SC8R
*ELGEN,ELSET=EALL
*ELEMENT,TYPE=SC8R
*ELGEN,ELSET=EALL
*ELSET,ELSET=PRINT
*TRANSFORM,TYPE=C,NSET=ALL
*SHELL SECTION,ELSET=EALL,MATERIAL=MAT, POISSON=ELASTIC
3.0,
*MATERIAL,NAME=MAT
*ELASTIC
3.0E6,0.3
*BOUNDARY
BND22,YSYMM
BND1,ZSYMM
BND4,YSYMM
BND3,2
BND3,1
*MPC
 TIE,1601,2409
 TIE,1709,1608
 TIE,1809,1607
 TIE,1909,1606
 TIE,2009,1605
 TIE,2109,1604
 TIE,2209,1603
 TIE,2309,1602
 TIE,11601,12409
 TIE,11709,11608
 TIE,11809,11607
 TIE,11909,11606
 TIE,12009,11605
 TIE,12109,11604
 TIE,12209,11603
 TIE,12309,11602
*STEP
*STATIC
*CLOAD
25,1,-0.125
10025,1,-0.125
*EL PRINT,ELSET=PRINT
*EL FILE,ELSET=PRINT
S,E
*OUTPUT,FIELD
*ELEMENT OUTPUT,ELSET=PRINT
S,E
*NODE FILE,NSET=P1
U,RF
*OUTPUT,FIELD
*NODE OUTPUT
U,RF
*END STEP