*HEADING
SUBMODEL OF PINCHED CYLINDER - S8R - 10 x 10 MESH
*NSET,NSET=NOUT
*PREPRINT,ECHO=YES,MODEL=NO,HISTORY=NO
*NODE,NSET=P1
*NGEN,NSET=LOADB
*NGEN,NSET=BND3
*NGEN,NSET=BND2
*NGEN,NSET=BND4
*NFILL,NSET=ALL
BND2,BND4,20
*NMAP,TYPE=CYLINDRICAL,NSET=ALL
*ELEMENT,TYPE=S8R,ELSET=EALL
*ELGEN,ELSET=EALL
*ELSET,ELSET=PRINT
*TRANSFORM,TYPE=C,NSET=ALL
*SHELL SECTION,ELSET=EALL,MATERIAL=M1
3.0,
*MATERIAL,NAME=M1
*ELASTIC
3.0E6,0.3
*SUBMODEL,EXTERIOR TOLERANCE=0.2
LOADB,BND4,
*NSET,NSET=YBND,GENERATE
*NSET,NSET=ZBND,GENERATE
*BOUNDARY
YBND,YSYMM
ZBND,ZSYMM
*STEP
*STATIC
*BOUNDARY,SUBMODEL,STEP=1
LOADB,1,6
BND4,1,6
*CLOAD
2001,1,-0.25
*EL PRINT,ELSET=PRINT
*EL FILE,ELSET=PRINT
SF,
*OUTPUT,FIELD
*ELEMENT OUTPUT,ELSET=PRINT
SF,
*NODE FILE
U,RF
*OUTPUT,FIELD
*NODE OUTPUT
U,RF
*NODE PRINT,SUMMARY=NO,NSET=NOUT
U,
*END STEP