*HEADING
PINCHED CYLINDER WITH DIAPHRAGMS AT ENDS, S4R - C3D8I SHELL TO SOLID
COUPLING
*PREPRINT, MODEL=YES, HISTORY=YES
** JOB NAME: PINCHCYL_S4R_C3D8I_SHELLTOSOLID MODEL NAME: MODEL-1
**
** PARTS
**
*PART, NAME=PART-1
*END PART
*PART, NAME=PART-2
*END PART
**
** ASSEMBLY
**
*ASSEMBLY, NAME=ASSEMBLY
**
*INSTANCE, NAME=PART-1-1, PART=PART-1
*NODE, NSET=NALL
*ELEMENT, TYPE=S4R, ELSET=EALL
** REGION: (SECTION-2:PICKED)
*ELSET, ELSET=_I1, INTERNAL, GENERATE
** SECTION: SECTION-2
*SHELL SECTION, ELSET=_I1, MATERIAL=MATERIAL-1
3., 5
*END INSTANCE
**
*INSTANCE, NAME=PART-2-1, PART=PART-2
*NODE, NSET=NALL
*ELEMENT, TYPE=C3D8R, ELSET=EALL
** REGION: (SECTION-1:PICKED)
*ELSET, ELSET=_I1, INTERNAL, GENERATE
** SECTION: SECTION-1
*SOLID SECTION, ELSET=_I1, MATERIAL=MATERIAL-1
1.,
*END INSTANCE
*NSET, NSET=_G8, INTERNAL, INSTANCE=PART-2-1
*NSET, NSET=_G9, INTERNAL, INSTANCE=PART-1-1
*ELSET, ELSET=_G9, INTERNAL, INSTANCE=PART-1-1
*NSET, NSET=_G10, INTERNAL, INSTANCE=PART-1-1
*ELSET, ELSET=_G10, INTERNAL, INSTANCE=PART-1-1, GENERATE
*NSET, NSET=_G11, INTERNAL, INSTANCE=PART-1-1
*NSET, NSET=_G11, INTERNAL, INSTANCE=PART-2-1
*ELSET, ELSET=_G11, INTERNAL, INSTANCE=PART-1-1, GENERATE
*ELSET, ELSET=_G11, INTERNAL, INSTANCE=PART-2-1
*NSET, NSET=_G12, INTERNAL, INSTANCE=PART-1-1
*NSET, NSET=_G12, INTERNAL, INSTANCE=PART-2-1, GENERATE
*ELSET, ELSET=_G12, INTERNAL, INSTANCE=PART-1-1, GENERATE
*ELSET, ELSET=_G12, INTERNAL, INSTANCE=PART-2-1, GENERATE
*ELSET, ELSET=_SURF-1_E1, INTERNAL, INSTANCE=PART-1-1
*SURFACE, TYPE=ELEMENT, NAME=SURF-1
_SURF-1_E1, E1
*ELSET, ELSET=_SURF-2_S6, INTERNAL, INSTANCE=PART-2-1, GENERATE
*ELSET, ELSET=_SURF-2_S5, INTERNAL, INSTANCE=PART-2-1
*SURFACE, TYPE=ELEMENT, NAME=SURF-2
_SURF-2_S6, S6
_SURF-2_S5, S5
** CONSTRAINT: CONSTRAINT-1
*SHELL TO SOLID COUPLING, CONSTRAINT NAME=CONSTRAINT-1
SURF-1, SURF-2
*END ASSEMBLY
**
** MATERIALS
**
*MATERIAL, NAME=MATERIAL-1
*ELASTIC
 3E+06, 0.3
*DENSITY
3.E-2,
** ----------------------------------------------------------------
*AMPLITUDE, NAME=AMP, DEFINITION=SMOOTH STEP
0.0,0.0,.9,1.0,10.0,1.0
*NSET, NSET=QA_TEST_ALLNODES
ASSEMBLY.PART-1-1.NALL, ASSEMBLY.PART-2-1.NALL
*ELSET, ELSET=EVP
ASSEMBLY.PART-1-1.EALL,
**
** STEP: STEP-1
**
*STEP, NAME=STEP-1
PINCH CYLINDER
*DYNAMIC, EXPLICIT
, 10.,
*DLOAD
EVP,VP,3.4
**
** BOUNDARY CONDITIONS
**
** NAME: BC-1 TYPE: DISPLACEMENT/ROTATION
*BOUNDARY
_G9, 2, 2
_G9, 3, 3
** NAME: BC-2 TYPE: SYMMETRY/ANTISYMMETRY/ENCASTRE
*BOUNDARY
_G10, YSYMM
** NAME: BC-3 TYPE: SYMMETRY/ANTISYMMETRY/ENCASTRE
*BOUNDARY
_G11, ZSYMM
** NAME: BC-4 TYPE: SYMMETRY/ANTISYMMETRY/ENCASTRE
*BOUNDARY
_G12, XSYMM
**
** LOADS
**
** NAME: LOAD-1   TYPE: CONCENTRATED FORCE
*CLOAD, AMPLITUDE=AMP
_G8, 2, -0.25
**
** OUTPUT REQUESTS
**
**
** FIELD OUTPUT: F-OUTPUT-1
**
*OUTPUT, FIELD, NUMBER=1
*NODE OUTPUT,NSET=QA_TEST_ALLNODES
U,
**RF
***ELEMENT OUTPUT
**S, LE
**
**HISTORY OUTPUT: H-OUTPUT-1
***OUTPUT,HISTORY,FREQ=1
***NODE OUTPUT, NSET=_G8
**U,
**
*END STEP