*Heading
Pinched Cylinder With Diaphragms At Ends, s4r - c3d10hs shell to solid coupling
** Job name: pinchcyl_s4r_c3d10hs_shell2solid Model name: Model-1
**
** PARTS
**
*Part, name=Part-1
*End Part
*Part, name=Part-2
*End Part
**
** ASSEMBLY
**
*Assembly, name=Assembly
**
*Instance, name=Part-1-1, part=Part-1
*Node
*Element, type=S4R
** Region: (Section-2:Picked)
*Elset, elset=_I1, internal, generate
** Section: Section-2
*Shell Section, elset=_I1, material=Material-1
3., 5
*End Instance
**
*Instance, name=Part-2-1, part=Part-2
*Node
*Element, type=C3D10HS
** Region: (Section-1:Picked)
*Elset, elset=_I1, internal, generate
** Section: Section-1
*Solid Section, elset=_I1, material=Material-1
1.,
*End Instance
*Nset, nset=_G8, internal, instance=Part-2-1
*Nset, nset=_G9, internal, instance=Part-1-1
*Elset, elset=_G9, internal, instance=Part-1-1
*Nset, nset=_G10, internal, instance=Part-1-1
*Elset, elset=_G10, internal, instance=Part-1-1, generate
*Nset, nset=_G11, internal, instance=Part-1-1
*Nset, nset=_G11, internal, instance=Part-2-1
*Elset, elset=_G11, internal, instance=Part-1-1, generate
*Elset, elset=_G11, internal, instance=Part-2-1
*Nset, nset=_G12, internal, instance=Part-1-1
*Nset, nset=_G12, internal, instance=Part-2-1
*Elset, elset=_G12, internal, instance=Part-1-1, generate
*Elset, elset=_G12, internal, instance=Part-2-1
*Elset, elset=_Surf-1_E1, internal, instance=Part-1-1
*Surface, type=ELEMENT, name=Surf-1
_Surf-1_E1, E1
*Elset, elset=_Surf-2_S3, internal, instance=Part-2-1
*Elset, elset=_Surf-2_S2, internal, instance=Part-2-1
*Elset, elset=_Surf-2_S4, internal, instance=Part-2-1
*Elset, elset=_Surf-2_S1, internal, instance=Part-2-1
*Surface, type=ELEMENT, name=Surf-2
_Surf-2_S3, S3
_Surf-2_S2, S2
_Surf-2_S4, S4
_Surf-2_S1, S1
** Constraint: Constraint-1
*Shell to solid coupling, constraint name=Constraint-1
Surf-1, Surf-2
*End Assembly
**
** MATERIALS
**
*Material, name=Material-1
*Elastic
 3e+06, 0.3
** ----------------------------------------------------------------
**
** STEP: Step-1
**
*Step, name=Step-1
pinch cylinder
*Static
1., 1., 1e-05, 1.
**
** BOUNDARY CONDITIONS
**
** Name: BC-1 Type: Displacement/Rotation
*Boundary
_G9, 2, 2
_G9, 3, 3
** Name: BC-2 Type: Symmetry/Antisymmetry/Encastre
*Boundary
_G10, YSYMM
** Name: BC-3 Type: Symmetry/Antisymmetry/Encastre
*Boundary
_G11, ZSYMM
** Name: BC-4 Type: Symmetry/Antisymmetry/Encastre
*Boundary
_G12, XSYMM
**
** LOADS
**
** Name: Load-1   Type: Concentrated force
*Cload
_G8, 2, -0.25
**
** OUTPUT REQUESTS
**
*Restart, write, frequency=1
**
** FIELD OUTPUT: F-Output-1
**
*Output, field
*Node Output
U, RF
*Element Output
S, LE
**
** HISTORY OUTPUT: H-Output-1
**
*Output, history, variable=PRESELECT
*El Print, freq=999999
*Node Print, freq=999999
*End Step