*HEADING
SUBMODEL OF PINCHED CYLINDER - C3D8I - 10 X 10 X 4 MESH
*NSET,NSET=NOUT
*PREPRINT,ECHO=YES,MODEL=NO,HISTORY=NO
*NODE,NSET=P1
*NGEN,NSET=BND2T
*NGEN,NSET=BND4T
**************************
*NODE,NSET=P2
*NGEN,NSET=BND2B
*NGEN,NSET=BND4B
*NFILL,NSET=BACK
BND2B,BND2T,4,20000
*NFILL,NSET=FRONT
BND4B,BND4T,4,20000
***********************************
*NFILL,NSET=ALL
BACK,FRONT,10,2
*NMAP,TYPE=CYLINDRICAL,NSET=ALL
**********************************
*NSET,NSET=LEFTB,GENERATE
*NSET,NSET=LEFTB,GENERATE
*NSET,NSET=LEFTB,GENERATE
*NSET,NSET=GLBND
LEFTB,FRONT
*NSET,NSET=RIGHTB,GENERATE
*NSET,NSET=RIGHTB,GENERATE
*NSET,NSET=RIGHTB,GENERATE
*NSET,NSET=ABOUND,GENERATE
*NSET,NSET=ABOUND,GENERATE
*NSET,NSET=ABOUND,GENERATE
*ELEMENT,TYPE=C3D8I,ELSET=EALL
*ELGEN,ELSET=EALL
*ELSET,ELSET=PRINT,GENERATE
*TRANSFORM,TYPE=C,NSET=ALL
*SOLID SECTION,ELSET=EALL,MATERIAL=M1
*MATERIAL,NAME=M1
*ELASTIC
3.0E6,0.3
*SUBMODEL,EXTERIOR TOLERANCE=.2,SHELL TO SOLID,SHELL THICKNESS=3.
GLBND,
*BOUNDARY
ABOUND,YSYMM
RIGHTB,ZSYMM
*RESTART,WRITE
*STEP
*STATIC
*CLOAD
42001,1,-0.25
*BOUNDARY,SUBMODEL,STEP=1
GLBND,.3
*EL PRINT,ELSET=PRINT
*EL FILE,ELSET=PRINT
S,
*NODE FILE
U,RF
*NODE PRINT,SUMMARY=NO,NSET=NOUT
U,
*END STEP