*HEADING
PINCHED CYLINDER WITH DIAPHRAGMS AT ENDS - S4R - 20 X 20 MESH
*PREPRINT,ECHO=YES,MODEL=NO,HISTORY=NO
*RESTART,TIMEMARKS=YES,WRITE,NUMBER INTERVAL=1
*NODE,NSET=CORNER
*NGEN,NSET=LOADB
*NGEN,NSET=BND3
*NGEN,NSET=BND2
*NGEN,NSET=BND4
*NFILL,NSET=ALL
BND2,BND4,20
*NMAP,TYPE=CYLINDRICAL,NSET=ALL
*ELEMENT,TYPE=S4R
*ELGEN,ELSET=EALL
*ELSET,ELSET=PRINT
*ELSET,ELSET=ELOUT,GENERATE
*NSET,NSET=NOUT
BND2,BND3,BND4,LOADB
*NSET,NSET=PRINT
*TRANSFORM,TYPE=C,NSET=ALL
*SHELL SECTION,ELSET=EALL,MATERIAL=MAT,SECTION INTEGRATION=GAUSS
3.0,
*MATERIAL,NAME=MAT
*ELASTIC
3.0E6,0.3
*DENSITY
3.0E-2,
*BOUNDARY
BND2,YSYMM
BND3,ZSYMM
BND4,YSYMM
LOADB,2
LOADB,1
*AMPLITUDE,NAME=RAMP
0.0,0.0, 0.9,1.0, 10.0,1.0
*NSET,NSET=QA_TEST_BND3
BND3,
**
*STEP,NLGEOM=YES
*DYNAMIC,EXPLICIT
 ,10.0
*DLOAD
EALL,VP,3.5
*CLOAD
2001,1,-0.25
***OUTPUT,HISTORY,TIME INTERVAL=0.01
***ELEMENT OUTPUT,ELSET=PRINT
**S,LE
***NODE OUTPUT,NSET=PRINT
**U,RF
***ENERGY OUTPUT
**ALLKE,ALLIE,ALLSE,ALLAE,ALLVD,ALLWK,ETOTAL,DT
*FILE OUTPUT,TIMEMARKS=YES, NUMBER INTERVAL=4
*NODE FILE,NSET=BND3
U,
*ENERGY FILE
*OUTPUT, FIELD, TIMEMARKS=YES, NUMBER INTERVAL=4
*NODE OUTPUT, NSET=QA_TEST_BND3
U,
*OUTPUT,FIELD,VARIABLE=PRESELECT
*OUTPUT,HISTORY,VARIABLE=PRESELECT,TIMEINT=2.5
*END STEP