*HEADING
PINCHED CYL. WITH DIAPH. AT ENDS, COARSE IRREG. MESH - S3R TYPE 1
*PREPRINT,ECHO=YES,MODEL=NO,HISTORY=NO
*RESTART,TIMEMARKS=YES,WRITE,NUMBER INTERVAL=1
*NODE
*NGEN,NSET=BND1A
*NGEN,NSET=BND1B
*NSET,NSET=BND1
BND1A,BND1B
*NGEN,NSET=BND2
*NGEN,NSET=BND3
*NGEN,NSET=BND4A
*NGEN,NSET=BND4B
*NSET,NSET=BND4
BND4A,BND4B
*NGEN,NSET=NODES1
*NGEN,NSET=NODES2
*NFILL,NSET=ALL
BND2,NODES1,8
NODES2,BND3,8,100
NODES1,BND4A,16
*NMAP,TYPE=CYLINDRICAL,NSET=ALL
*ELEMENT,TYPE=S3R
*ELGEN,ELSET=EALL
*ELEMENT,TYPE=S3R
*ELGEN,ELSET=EALL
*ELSET,ELSET=PRINT
*ELSET,ELSET=ELOUT,GENERATE
*NSET,NSET=NOUT
BND1,BND2,BND3,BND4
*NSET,NSET=PRINT
*TRANSFORM,TYPE=C,NSET=ALL
*SHELL SECTION,ELSET=EALL,MATERIAL=MAT,SECTION INTEGRATION=GAUSS
3.0,
*MATERIAL,NAME=MAT
*ELASTIC
3.0E6,0.3
*DENSITY
3.0E-2,
*BOUNDARY
BND2,YSYMM
BND1,ZSYMM
BND4,YSYMM
BND3,2
BND3,6
BND3,1
*MPC
TIE,1809,1607
TIE,2009,1605
TIE,2209,1603
TIE,2409,1601
*AMPLITUDE,NAME=RAMP
0.0,0.0, 0.9,1.0, 10.0,1.0
*NSET,NSET=QA_TEST_BND1
BND1,
**
*STEP,NLGEOM=YES
*DYNAMIC,EXPLICIT
 ,10.0
*DLOAD
EALL,VP,3.4
*CLOAD,AMPLITUDE=RAMP
25,1,-0.25
***OUTPUT,HISTORY,TIME INTERVAL=0.01
***ELEMENT OUTPUT,ELSET=PRINT
**S,LE
***NODE OUTPUT,NSET=PRINT
**U,RF
***ENERGY OUTPUT
**ALLKE,ALLIE,ALLSE,ALLAE,ALLVD,ALLWK,ETOTAL,DT
*FILE OUTPUT,TIMEMARKS=YES, NUMBER INTERVAL=4
*NODE FILE,NSET=BND1
U,
*ENERGY FILE
*OUTPUT, FIELD, TIMEMARKS=YES, NUMBER INTERVAL=4
*NODE OUTPUT, NSET=QA_TEST_BND1
U,
*OUTPUT,FIELD,VARIABLE=PRESELECT
*OUTPUT,HISTORY,VARIABLE=PRESELECT,TIMEINT=2.5
*END STEP