*Heading
** Job name: Job-1 Model name: partsatflow_cpe6mp
**
** PARTS
**
*Part, name=Part-1
*End Part
**
** ASSEMBLY
**
*Assembly, name=Assembly
**
*Instance, name=Part-1-1, part=Part-1
*Node
*Element, type=CPE6MP
** Region: (Section-1-BLOCK:Picked)
*Elset, elset=_I1, internal, generate
** Section: Section-1-BLOCK
*Solid Section, elset=_I1, material=CORE
0.02,
*End Instance
*Nset, nset=BOT, instance=Part-1-1
*Elset, elset=BOT, instance=Part-1-1
*Nset, nset=TOP, instance=Part-1-1
*Elset, elset=TOP, instance=Part-1-1
*Nset, nset=CENTER, instance=Part-1-1
*Nset, nset=QA_TEST_ELEM, instance=Part-1-1
*Elset, elset=QA_TEST_ELEM, instance=Part-1-1
*Nset, nset=QA_TEST_NODE, instance=Part-1-1
*Elset, elset=QA_TEST_NODE, instance=Part-1-1
*Nset, nset=OUTE, instance=Part-1-1
*Elset, elset=OUTE, instance=Part-1-1
*Nset, nset=OUTN, instance=Part-1-1
*Elset, elset=OUTN, instance=Part-1-1
*Nset, nset=ALLN, instance=Part-1-1, generate
*Elset, elset=ALLN, instance=Part-1-1, generate
*Nset, nset=PORN, instance=Part-1-1, generate
*Elset, elset=PORN, instance=Part-1-1, generate
*End Assembly
**
** MATERIALS
**
*Material, name=CORE
*Elastic
100000.,0.
*Gel
*Permeability, specific=10000.
 0.00037,0.
*Porous Bulk Moduli
*Sorption
*Sorption, type=Exsorption
*initial conditions,type=saturation
ALLN,0.05
*initial conditions,type=ratio
ALLN,5.
*initial conditions,type=pore pressure
PORN,-10000.
** ----------------------------------------------------------------
**
** STEP: Step-1
**
*Step, name=Step-1, inc=100
*Soils, consolidation, end=PERIOD, utol=10000.
**
** BOUNDARY CONDITIONS
**
** Name: Disp-BC-1 Type: Symmetry/Antisymmetry/Encastre
*Boundary
ALLN, PINNED
**
** LOADS
**
** Name: Load-1   Type: Concentrated pore fluid
*BOUNDARY
CENTER, 8,, -100.
**
** CONTROLS
**
*Controls, reset
*Controls, analysis=discontinuous
*Controls, parameters=field, field=pore fluid pressure
0.01, 1., , 1e-06, , , , ,
**
** OUTPUT REQUESTS
**
*Restart, write, frequency=10
**
** FIELD OUTPUT: F-Output-1
**
*Output, field, variable=PRESELECT
**
** FIELD OUTPUT: F-Output-2
**
*Output, field
*Node Output
POR,
**
** HISTORY OUTPUT: H-Output-2
**
*Output, history
*Element Output, elset=OUTE
SAT, VOIDR, GELVR
**
** HISTORY OUTPUT: H-Output-1
**
*Node Output, nset=OUTN
POR, RVF, RVT
**
** HISTORY OUTPUT: H-Output-4
**
*Output, history, frequency=5
*Element Output, elset=QA_TEST_ELEM
SAT, VOIDR, GELVR
**
** HISTORY OUTPUT: H-Output-3
**
*Node Output, nset=QA_TEST_NODE
POR, RVF, RVT
*El Print, freq=999999
*Node Print, freq=999999
*End Step
** ----------------------------------------------------------------
**
** STEP: Step-2
**
*Step, name=Step-2, inc=20
*Soils, consolidation, end=PERIOD, utol=10000.
**
** BOUNDARY CONDITIONS
**
** Name: Disp-BC-1 Type: Symmetry/Antisymmetry/Encastre
*Boundary, op=NEW
** Name: Disp-BC-2 Type: Symmetry/Antisymmetry/Encastre
*Boundary, op=NEW
ALLN, PINNED
**
** LOADS
**
** Name: Load-2   Type: Concentrated pore fluid
*BOUNDARY, op=NEW
CENTER, 8,, -10000.
**
** OUTPUT REQUESTS
**
*Restart, write, frequency=10
**
** FIELD OUTPUT: F-Output-3
**
*Output, field, variable=PRESELECT
**
** FIELD OUTPUT: F-Output-4
**
*Output, field
*Node Output
POR,
**
** HISTORY OUTPUT: H-Output-6
**
*Output, history
*Element Output, elset=OUTE
SAT, VOIDR, GELVR
**
** HISTORY OUTPUT: H-Output-5
**
*Node Output, nset=OUTN
POR, RVF, RVT
**
** HISTORY OUTPUT: H-Output-8
**
*Output, history, frequency=5
*Element Output, elset=QA_TEST_ELEM
SAT, VOIDR, GELVR
**
** HISTORY OUTPUT: H-Output-7
**
*Node Output, nset=QA_TEST_NODE
POR, RVF, RVT
*End Step
** ----------------------------------------------------------------
**
** STEP: Step-3
**
*Step, name=Step-3, inc=50
*Soils, consolidation, end=PERIOD, utol=10000.
**
** BOUNDARY CONDITIONS
**
** Name: Disp-BC-2 Type: Symmetry/Antisymmetry/Encastre
*Boundary, op=NEW
** Name: Disp-BC-3 Type: Symmetry/Antisymmetry/Encastre
*Boundary, op=NEW
ALLN, PINNED
**
** LOADS
**
** Name: Load-3   Type: Concentrated pore fluid
*BOUNDARY, op=NEW
CENTER, 8,, -100.
**
** OUTPUT REQUESTS
**
*Restart, write, frequency=10
**
** FIELD OUTPUT: F-Output-5
**
*Output, field, variable=PRESELECT
**
** FIELD OUTPUT: F-Output-6
**
*Output, field
*Node Output
POR,
**
** HISTORY OUTPUT: H-Output-10
**
*Output, history
*Element Output, elset=OUTE
SAT, VOIDR, GELVR
**
** HISTORY OUTPUT: H-Output-9
**
*Node Output, nset=OUTN
POR, RVF, RVT
**
** HISTORY OUTPUT: H-Output-12
**
*Output, history, frequency=5
*Element Output, elset=QA_TEST_ELEM
SAT, VOIDR, GELVR
**
** HISTORY OUTPUT: H-Output-11
**
*Node Output, nset=QA_TEST_NODE
POR, RVF, RVT
*End Step