*HEADING
 TIP LOADED CANTILEVER  -  LARGE ROTATION  - 10 M3D4R
*NODE
*NODE,NSET=N2
*NODE
*NGEN,NSET=NALL
*ELEMENT , TYPE=M3D4R, ELSET=BEAM
*ELGEN,ELSET=BEAM
*MEMBRANE SECTION , ELSET=BEAM, MATERIAL=MATE1,CONTROLS=HGC
0.1,
*SECTION CONTROLS,NAME=HGC,HOURGLASS=ENHANCED
*MATERIAL,NAME=MATE1
*ELASTIC
1.E8,
*ELEMENT,TYPE=DCOUP3D,ELSET=TIPLOAD
*DISTRIBUTING COUPLING, ELSET=TIPLOAD
*BOUNDARY
N2,1,2
NALL,3,3
*RESTART,WRITE,FREQUENCY=2
*STEP , NLGEOM      ,INC=200
LARGE ROTATION ANALYSIS
*STATIC
0.05 ,     1.0
*CLOAD
1001,2,269.35
*OUTPUT,FIELD
*ELEMENT OUTPUT
S,
LE,
*NODE OUTPUT
RF,
CF,
U,
*NSET,NSET=NOUT
*ELSET,ELSET=EOUT
*OUTPUT,HISTORY
*NODE OUTPUT,NSET=N2
RF,
*NODE OUTPUT,NSET=NOUT
U,
*ELEMENT OUTPUT,ELSET=EOUT
S,
LE,
*ENERGY OUTPUT,VARIABLE=PRESELECT
*END STEP