*HEADING
 CANTILEVER WITH A TIP MOMENT -  LARGE ROTATION  -  2x40 CPS6M
*NODE
*NGEN
*ELEMENT , TYPE=CPS6M, ELSET=BEAM
*ELGEN,ELSET=BEAM
*SOLID SECTION , ELSET=BEAM, MATERIAL=MATE1
0.1,
*NSET, NSET=N_ENDS
*NSET,NSET=NOUT
*MATERIAL,NAME=MATE1
*ELASTIC
1.E8,
*ELEMENT,TYPE=DCOUP2D,ELSET=ENDMOMENT
*DISTRIBUTING COUPLING, ELSET=ENDMOMENT
*BOUNDARY
81,1,2
181,1,2
281,1,2
*RESTART,WRITE,FREQUENCY=5
*STEP,NLGEOM,INC=1000, UNSYMM=YES
*STATIC
0.05 ,     1.0
*CLOAD
1001,6,-3384.7808
*NODE PRINT, FREQUENCY=5, NSET=N_ENDS
U,RF,CF
*EL PRINT, FREQUENCY=5
*NODE FILE, FREQUENCY=5
U,RF
*NODE FILE, NSET=NOUT,FREQUENCY=5
CF,
*ELSET, ELSET=ENDS
*EL FILE, ELSET=ENDS, FREQUENCY=6
E,NE,LE
EP,NEP,LEP
*EL FILE, ELSET=ENDMOMENT, FREQUENCY=6
NFORC,
*END STEP