*HEADING
 TIP LOADED CANTILEVER  -  LARGE ROTATION  - 10 CPS6
*NODE
*NODE
*NGEN
*ELEMENT , TYPE=CPS6, ELSET=BEAM
*ELGEN,ELSET=BEAM
*SOLID SECTION , ELSET=BEAM, MATERIAL=MATE1
0.1,
*MATERIAL,NAME=MATE1
*ELASTIC
1.E8,
*SURFACE, NAME=NODE_BASED_SURFACE, TYPE=NODE
*COUPLING, CONSTRAINT NAME=COUPLING_DEFINITION, REF NODE=1001, SURFACE=NODE_BASED_SURFACE
*DISTRIBUTING
*BOUNDARY
11,1,2
111,1,2
211,1,2
*RESTART,WRITE,FREQUENCY=2
*STEP , NLGEOM      ,INC=25
LARGE ROTATION ANALYSIS
*STATIC
0.2 ,     1.0
*CLOAD
1001,2,269.35
*ENERGY PRINT, FREQUENCY=5
*NODE PRINT, FREQUENCY=5
U,RF,CF
*EL PRINT, FREQUENCY=5
S,E
*NODE FILE, FREQUENCY=2
U,RF,CF
*ELSET, ELSET=ENDS
*EL FILE, ELSET=ENDS, FREQUENCY=6
E,NE,LE
EP,NEP,LEP
** *EL FILE, ELSET=TIPLOAD
** NFORC,
*END STEP