*HEADING
 CANTILEVER WITH A TIP MOMENT -  LARGE ROTATION  -  40 CPS4R
*NODE
*NODE,NSET=N2
*NGEN
*ELEMENT , TYPE=CPS4R, ELSET=BEAM
*ELGEN,ELSET=BEAM
*SOLID SECTION , ELSET=BEAM, MATERIAL=MATE1,controls=hgc
0.1,
*section controls,name=hgc,hourglass=enhanced
*MATERIAL,NAME=MATE1
*ELASTIC
1.E8,
*SURFACE, NAME=NODE_BASED_SURFACE, TYPE=NODE
*COUPLING, CONSTRAINT NAME=COUPLING_DEFINITION, REF NODE=1001, SURFACE=NODE_BASED_SURFACE
*DISTRIBUTING
*BOUNDARY
N2,1,2
*RESTART,WRITE,FREQUENCY=5
*STEP,NLGEOM,INC=100, UNSYMM=YES,EXTRAPOLATION=PARABOLIC
*STATIC
0.05 ,     1.0
*CLOAD
1001,6,-3384.7808
*CONTROLS, PARAMETERS=FIELD
,0.0,
*NODE PRINT
U,
RF,
CF,
*EL PRINT
S,
LE,
*OUTPUT,FIELD
*NODE OUTPUT
RF,
U
*ELEMENT OUTPUT
S,
LE,
*NSET,NSET=NOUT
*ELSET,ELSET=EOUT
*OUTPUT,HISTORY
*NODE OUTPUT,NSET=N2
RF,
*NODE OUTPUT,NSET=NOUT
U,
*ELEMENT OUTPUT,ELSET=EOUT
S,
LE,
*ENERGY OUTPUT,VARIABLE=PRESELECT
*END STEP