*HEADING
 TIP LOADED CANTILEVER  -  LARGE ROTATION  - 20 C3D8R
*NODE,NSET=N1
*NODE
*NODE,NSET=N2
*NGEN
*ELEMENT, TYPE=C3D8R, ELSET=BEAM
*ELGEN,ELSET=BEAM
*SOLID SECTION , ELSET=BEAM, MATERIAL=MATE1,CONTROLS=HGC
*SECTION CONTROLS,NAME=HGC,HOURGLASS=ENHANCED
*MATERIAL,NAME=MATE1
*ELASTIC
1.E8,
** *ELEMENT,TYPE=DCOUP3D,ELSET=TIPLOAD
** 1001,1001
** *DISTRIBUTING COUPLING, ELSET=TIPLOAD
** N1,1.0
*SURFACE, NAME=NODE_BASED_SURFACE, TYPE=NODE
 N1, 1.0
*COUPLING, CONSTRAINT NAME=COUPLING_DEFINITION, REF NODE=1001, SURFACE=NODE_BASED_SURFACE
*DISTRIBUTING
*BOUNDARY
N2,1,3
*RESTART,WRITE,FREQUENCY=2
*STEP , NLGEOM      ,INC=25
LARGE ROTATION ANALYSIS
*STATIC
0.05 ,     1.0
*CLOAD
1001,2,269.35
*OUTPUT,FIELD
*ELEMENT OUTPUT
S,
LE,
*NODE OUTPUT
RF,
CF,
U,
*NSET,NSET=NOUT
*ELSET,ELSET=EOUT
*OUTPUT,HISTORY
*NODE OUTPUT,NSET=N2
RF,
*NODE OUTPUT,NSET=NOUT
U,
*ELEMENT OUTPUT,ELSET=EOUT
S,
LE,
*ENERGY OUTPUT,VARIABLE=PRESELECT
*END STEP