*HEADING
 TIP LOADED CANTILEVER  -  LARGE ROTATION  - 10 C3D8
*NODE,NSET=N1
*NODE
*NODE,NSET=N2
*NGEN
*ELEMENT, TYPE=C3D8, ELSET=BEAM
*ELGEN,ELSET=BEAM
*SOLID SECTION , ELSET=BEAM, MATERIAL=MATE1
*MATERIAL,NAME=MATE1
*ELASTIC
1.E8,
*ELEMENT,TYPE=DCOUP3D,ELSET=TIPLOAD
*DISTRIBUTING COUPLING, ELSET=TIPLOAD
N1,1.0
*BOUNDARY
N2,1,3
*RESTART,WRITE,FREQUENCY=2
*STEP , NLGEOM      ,INC=25
LARGE ROTATION ANALYSIS
*STATIC
0.05 ,     1.0
*CLOAD
1001,2,269.35
*ENERGY PRINT,FREQUENCY=5
*NODE PRINT,FREQUENCY=2
*EL PRINT,FREQUENCY=5
S,
E,
*NODE FILE,FREQUENCY=5
U,RF,CF
*ELSET, ELSET=ENDS
*ELSET, ELSET=TWO
*EL FILE,ELSET=ENDS,FREQUENCY=6
E,NE,LE
EP,NEP,LEP
*EL FILE,ELSET=TWO,FREQUENCY=6,POSITION=AVERAGED
EP,NEP,LEP
*EL FILE, ELSET=TIPLOAD
NFORC,
*END STEP