*HEADING
 TIP LOADED CANTILEVER  -  LARGE ROTATION  - 50 C3D10M
**
**
*NODE
*NODE
**
**
*ELEMENT, TYPE=C3D10M, ELSET=PROPP
*SOLID SECTION, ELSET=PROPP, MATERIAL=MATE1
          1.,
*MATERIAL, NAME=MATE1
*ELASTIC
1.E+8,
** *ELEMENT,TYPE=DCOUP3D,ELSET=TIPLOAD
** 1001,1001
** *DISTRIBUTING COUPLING, ELSET=TIPLOAD
**        1, 1.0
**       22, 1.0
**       43, 1.0
**       64, 1.0
**       85, 1.0
**       96, 1.0
**      117, 1.0
**      138, 1.0
**      159, 1.0
*SURFACE, NAME=NODE_BASED_SURFACE, TYPE=NODE
*COUPLING, CONSTRAINT NAME=COUPLING_DEFINITION, REF NODE=1001, SURFACE=NODE_BASED_SURFACE
*DISTRIBUTING
*BOUNDARY
21, 1,3
42,1,3
63,1,3
84,1,3
95,1,3
116,1,3
137,1,3
158,1,3
*RESTART,WRITE,FREQUENCY=2
*STEP, INC=25, NLGEOM
LARGE ROTATION ANALYSIS
*STATIC
0.2, 1.
*CLOAD
1001,2,269.35
*ENERGY PRINT, FREQUENCY=5
*NODE PRINT, FREQ=5
U,
*EL PRINT, FREQUENCY=5
S,
E ,
*NODE FILE, FREQUENCY=2
U,RF,CF
*ELSET,ELSET=ENDS
*EL FILE, ELSET=ENDS, FREQUENCY=6
E,NE,LE
EP,NEP,LEP
** *EL FILE, ELSET=TIPLOAD
** NFORC,
*END STEP