*HEADING
 TIP LOADED CANTILEVER  -  LARGE ROTATION  - 25 C3D10M
**
**
*NODE
*NODE
*NGEN
*ELEMENT, TYPE=C3D10M, ELSET=PROPP
*ELGEN, ELSET=PROPP
*SOLID SECTION, ELSET=PROPP, MATERIAL=MATE1
          1.,
*MATERIAL, NAME=MATE1
*ELASTIC
1.E+8,
*SURFACE, NAME=NODE_BASED_SURFACE, TYPE=NODE
*COUPLING, CONSTRAINT NAME=COUPLING_DEFINITION, REF NODE=1001, SURFACE=NODE_BASED_SURFACE
*DISTRIBUTING
*BOUNDARY
11, 1,3
32,1,3
53,1,3
74,1,3
95,1,3
106,1,3
127,1,3
148,1,3
*RESTART,WRITE,FREQUENCY=2
*STEP, INC=25, NLGEOM
LARGE ROTATION ANALYSIS
*STATIC
0.2, 1.
*CLOAD
1001,2,269.35
*CONTROLS, PARAMETERS=FIELD
,0.0,
*ENERGY PRINT, FREQUENCY=5
*NODE PRINT, FREQ=5
U,
*EL PRINT, FREQUENCY=5
S,
E ,
*NODE FILE, FREQUENCY=2
U,RF,CF
*ELSET,ELSET=ENDS
*EL FILE, ELSET=ENDS, FREQUENCY=6
E,NE,LE
EP,NEP,LEP
** *EL FILE, ELSET=TIPLOAD
** NFORC,
*END STEP