*HEADING
 TIP LOADED CANTILEVER  -  LARGE ROTATION  - 50 C3D10
**
**
*NODE
*NODE
**
**
*ELEMENT, TYPE=C3D10, ELSET=PROPP
*SOLID SECTION, ELSET=PROPP, MATERIAL=MATE1
          1.,
*MATERIAL, NAME=MATE1
*ELASTIC
1.E+8,
*ELEMENT,TYPE=DCOUP3D,ELSET=TIPLOAD
*DISTRIBUTING COUPLING, ELSET=TIPLOAD
*BOUNDARY
21, 1,3
42,1,3
63,1,3
84,1,3
95,1,3
116,1,3
137,1,3
158,1,3
*RESTART,WRITE,FREQUENCY=2
*STEP, INC=25, NLGEOM
LARGE ROTATION ANALYSIS
*STATIC
0.2, 1.
*CLOAD
1001,2,269.35
*ENERGY PRINT, FREQUENCY=5
*NODE PRINT, FREQ=5
U,
*EL PRINT, FREQUENCY=5
S,
E ,
*NODE FILE, FREQUENCY=2
U,RF,CF
*ELSET,ELSET=ENDS
*EL FILE, ELSET=ENDS, FREQUENCY=6
E,NE,LE
EP,NEP,LEP
*EL FILE, ELSET=TIPLOAD
NFORC,
*END STEP