*HEADING
 CANTILEVER WITH A TIP MOMENT -  LARGE ROTATION
*NODE
*NGEN,NSET=NALL
*ELEMENT,TYPE=B32OSH
*ELGEN,ELSET=EALL
*BEAM SECTION,SECTION=I,MATERIAL=A1,ELSET=EALL
 .1, .2, .1, .1, .01, .01, .01
*MATERIAL,NAME=A1
*ELASTIC
 1.E8,
*BOUNDARY
 21,1,6
 NALL,3,5
*RESTART,WRITE,FREQUENCY=999
*STEP,NLGEOM,INC=30
  CONCENTRATED TIP MOMENT
*STATIC
 .2,1.
*EL PRINT,FREQUENCY=5
S,E
*NODE FILE,NSET=NALL
U,
RF,
*NODE PRINT,SUMMARY=NO
U,
RF,
CF2,
*CLOAD
 1,6,2873.0908
*END STEP