*HEADING
 TIP LOADED CANTILEVER  -  LARGE ROTATION
*NODE,NSET=NALL
*ELEMENT,TYPE=B31OSH
*ELGEN,ELSET=EALL
*BEAM SECTION,SECTION=I,MATERIAL=A1,ELSET=EALL
 .1, .2, .1, .1, .01, .01, .01
*MATERIAL,NAME=A1
*ELASTIC
 1.E8,
*BOUNDARY
 4,1,6
 NALL,3,5
*STEP,NLGEOM,INC=25
  CONCENTRATED TIP LOAD
*STATIC
 .2,1.
*EL PRINT,FREQUENCY=5
S,E
*NODE FILE,NSET=NALL
U,
RF,
*NODE PRINT,SUMMARY=NO
U,
RF,
CF2,
*CLOAD
 1,2,269.35
*END STEP