*HEADING
: NAFEMS TEST LE3, Hemispherical Shell with Point Loads  [S3R]
*ELEMENT,TYPE=S3R   ,ELSET=S3_P2
*ELEMENT,TYPE=S3R   ,ELSET=S3_P4
*NODE
*ELSET,ELSET=EALL
S3_P2,S3_P4
*MATERIAL,NAME=A1
*ELASTIC,TYPE=ISO
 6.825E+07,     0.3000,     0.0000
**GENERAL RIGID ELEMENTS
*SHELL SECTION,MATERIAL=A1,ELSET=EALL
 4.000E-02,
*NSET,NSET=DISPSET
*NSET,NSET=ZCONSTR
*NSET,NSET=YSYM
*NSET,NSET=XSYM
*STEP
*STATIC
*BOUNDARY,OP=NEW
 ZCONSTR,3
 XSYM,XSYMM
 YSYM,YSYMM
*CLOAD,OP=NEW
    8,     1,  2.000E+00
   18,     2, -2.000E+00
   64,     1,  2.000E+00
   92,     2, -2.000E+00
*NODE PRINT,NSET=DISPSET
 U,
 COORD,
*NODE FILE,NSET=DISPSET
 U,
 COORD,
*OUTPUT,FIELD
*NODE OUTPUT,NSET=DISPSET
U,
COORD,
*EL PRINT,FREQUENCY=0
*END STEP