*HEADING
: NAFEMS TEST LE11: SOLID CYLINDER/TAPER/SPHERE - TEMPERATURE
COARSE MESH, C3D20R ELEMENTS
*NODE
*NGEN,LINE=C
*NGEN
*NGEN,LINE=C
*NGEN
*NSET,NSET=IN,GEN
*NSET,NSET=OUT,GEN
*NFILL,NSET=XZPLANE
IN,OUT,4,100
*NCOPY,SHIFT,CHANGE NUMBER=1000,MULTIPLE=12,OLD SET=XZPLANE,
NEWSET=REST
*NSET,NSET=YZPLANE,GEN
*NSET,NSET=XYPLANE,GEN
*NSET,NSET=HI,GEN
*NSET,NSET=ALLN
XZPLANE,REST
**
*ELEMENT,TYPE=C3D20R
*ELGEN,ELSET=ALLE
*ELSET,ELSET=EOUT
*SOLID SECTION,ELSET=ALLE,MATERIAL=MAT
*MATERIAL,NAME=MAT
*ELASTIC
210.E9,.3
*EXPANSION
2.3E-4,
*BOUNDARY
XZPLANE,2
YZPLANE,1
XYPLANE,3
HI,3
*STEP
*STATIC
*TEMPERATURE,USER
ALLN,
*NODE PRINT,F=0
*EL PRINT,ELSET=EOUT,POSITION=AVERAGED AT NODES
S,
*EL FILE,ELSET=EOUT,POSITION=AVERAGED AT NODES
S,
*ENDSTEP