*HEADING
: NAFEMS TEST FV41, [CAX4I] L.O.E. MESH
Stress displacement elements -- AXI-SYMMETRIC VIBRATION;
*NODE
*NGEN,NSET=IN
*NGEN,NSET=OUT
*NFILL,NSET=ALLN
IN,OUT,3,100
**
*ELEMENT,TYPE=CAX4I
*ELGEN,ELSET=ALLE
*SOLID SECTION,ELSET=ALLE,MATERIAL=MAT
*MATERIAL,NAME=MAT
*ELASTIC
200.E9,0.3
*DENSITY
8000.,
*STEP,PERT
*FREQUENCY, eigensolver=lanczos, SIM=NO
6, , ,-1.
*NODE PRINT,F=0
*EL PRINT,F=0
*OUTPUT,FIELD,VAR=PRESELECT
*ENDSTEP