*HEADING
*RESTART,WRITE,NUM=30
*NODE,INPUT=neck_ef1.inp
*ELEMENT, TYPE=CAX4R, ELSET=PID1,INPUT=neck_ef2.inp
*ELSET,ELSET=BOTTOM,GENERATE
*NSET,NSET=TOPSIDE,GENERATE
*NSET,NSET=C1,GEN
*NSET,NSET=C2
C1,1,11,22
*NSET,NSET=NECK,GENERATE
*NSET,NSET=NECKLINE
NECK
*NSET,NSET=QA_TEST_NSET
C1,
*ELSET,ELSET=QA_TEST_ELSET,GEN
*BOUNDARY
TOPSIDE,1,1,0.0
NECKLINE,2,2,0.0
c2,1,,0.
*SOLID SECTION,MATERIAL=BLOCK,ELSET=PID1
*MATERIAL,NAME=BLOCK
*ELASTIC
300.,.3
*PLASTIC
  0.1000000E+01,  0.0000000E+00
  0.1050000 E+01,  0.1672360E-02
  0.1100000E+01,  0.4315249E-02
  0.1150000E+01,  0.8364930E-02
  0.1200000E+01,  0.1442054E-01
  0.1250000E+01,  0.2329371E-01
  0.1300000E+01,  0.3607014E-01
  0.1350000E+01,  0.5418546E-01
  0.1400000E+01,  0.7951777E-01
*POROUS METAL PLASTICITY,RELATIVE DENSITY=1.
*VOID NUCLEATION
*POROUS FAILURE CRITERIA
*DENSITY
2.E-6,
*AMPLITUDE,NAME=TOPDISP
0.,0.,0.025,60.,0.05,0.
*STEP
*DYNAMIC,EXPLICIT
,0.05
*BOUNDARY,AMP=TOPDISP,TYPE=VELOCITY
TOPSIDE , 2 , 2 , 1.
*OUTPUT,FIELD,VARIABLE=PRESELECT,NUMBER INTERVAL=19
*OUTPUT,FIELD,OP=ADD,NUMBER INTERVAL=19
*ELEMENT OUTPUT
VVF,VVFN,VVFG
*******************************
*OUTPUT,FIELD,NUM=1
*NODE OUTPUT,NSET=QA_TEST_NSET
U,
*ELEMENT OUTPUT,ELSET=QA_TEST_ELSET
LE,
*******************************
*OUTPUT,HISTORY,TIME INTERVAL=1.0E-4
*NODE OUTPUT,NSET=TOPSIDE
RF,U
*NODE OUTPUT,NSET=NECK
RF,U
*END STEP