*HEADING
AXISYMMETRIC MODEL OF GROSCHWHEEL SOLID TIRE
*RESTART,WRITE
*PREPRINT,MODEL=YES
*NODE,NSET=INR
*NODE,NSET=OUTR
*NGEN,NSET=NTIRE
*NSET,NSET=BOT,GENERATE
*NSET,NSET=TOP,GENERATE
*ELEMENT,TYPE=CAX4RH
*ELGEN,ELSET=EALL
*elset, elset=outr
*elset,elset=inr
*SOLID SECTION,ELSET=EALL,MATERIAL=RUBBER
*MATERIAL,NAME=RUBBER
*HYPERELASTIC,YEOH
191.322,4.9415,0.5346,5.E-06
*MULLINS EFFECT,TEST DATA INPUT
*INCLUDE,INPUT=mullins_calibrate_testdata.inp
*plastic
50.0,  0.0
200.0, 0.02
1600.0, 0.1
6000.0,0.25
65000.0,1.75
*DENSITY
1.
*SURFACE,NAME=SINR
INR,S4
*SURFACE,NAME=SOUTR
OUTR,S2
*BOUNDARY
NTIRE,1,2,
*STEP,NLGEOM
*STATIC
*END STEP