*HEADING
AXISYMMETRIC MODEL OF GROSCHWHEEL SOLID TIRE
*RESTART,WRITE
*PREPRINT,MODEL=YES
*NODE,NSET=INR
*NODE,NSET=OUTR
*NGEN,NSET=NALL
*NSET,NSET=BOT,GENERATE
*NSET,NSET=TOP,GENERATE
*ELEMENT,TYPE=CAX4R,ELSET=INR
*ELGEN,ELSET=EALL
*elset, elset=outr
*SOLID SECTION,ELSET=EALL,MATERIAL=RUBBER
*MATERIAL,NAME=RUBBER
*HYPERELASTIC,YEOH
191.322,4.9415,0.5346,5.E-06
*MULLINS EFFECT,TEST DATA INPUT
*INCLUDE,INPUT=mullins_calibrate_testdata.inp
*DENSITY
0.43
*SURFACE,NAME=SINR
1,S4
*SURFACE,NAME=SOUTR
4,S2
*BOUNDARY
NALL,1,2,
*DIAGNOSTICS,NONHYBRID=WARNING
*STEP,NLGEOM
*STATIC
*END STEP