*HEADING
HILL PLASTICITY, UNIAXIAL TENSION TEST DIRECTION 1, C3D8
WITH LINEAR PERTURBATIONS AND MULTIPLE LOAD CASES
*NODE,NSET=ALLN
*ELEMENT,TYPE=C3D8,ELSET=ALLE
**local orientation matching global system
*ORIENTATION,NAME=RECT
*SOLID SECTION,ELSET=ALLE,MATERIAL=ALLE,ORIENT=RECT
*MATERIAL,NAME=ALLE
*ELASTIC
200.E3,.3
*PLASTIC
200.,0.
220.,.0009
220.,.0029
*POTENTIAL
*STEP,INC=10
STEP 1 - NONLINEAR
*STATIC,DIRECT
1.,10.
*BOUNDARY
1,PINNED
2,2
5,2
6,2
4,1
5,1
8,1
2,3
3,3
*EL PRINT
S,
SINV,
E,
PE,
EE,
*NODE PRINT
U,RF
*END STEP
*STEP,PERTURBATION,INC=1
STEP 2 - LINEAR PERTURBATION
*STATIC,DIRECT
.1,.1
*BOUNDARY
1,PINNED
2,2
5,2
6,2
4,1
5,1
8,1
2,3
3,3
*EL PRINT
S,
SINV,
E,
*NODE PRINT
U,RF
*END STEP
*STEP,INC=10
STEP 3 - REST OF NONLINEAR
*STATIC,DIRECT
1.,10.
*BOUNDARY
7,1,,.004
2,1,,.004
6,1,,.004
3,1,,.004
*END STEP
*STEP,PERTURBATION,INC=1
STEP 4 - MULTIPLE LOAD CASES
*STATIC,DIRECT
.1,.1
*LOAD CASE,NAME=STRETCH-1
*BOUNDARY
1,PINNED
2,2
5,2
6,2
4,1
5,1
8,1
2,3
3,3
*END LOAD CASE
*LOAD CASE,NAME=COMPRESS-1
*BOUNDARY
1,PINNED
2,2
5,2
6,2
4,1
5,1
8,1
2,3
3,3
*END LOAD CASE
*LOAD CASE,NAME=STRETCH-2
*BOUNDARY
1,PINNED
2,2
5,2
6,2
4,1
5,1
8,1
2,3
3,3
*END LOAD CASE
*LOAD CASE,NAME=COMPRESS-2
*BOUNDARY
1,PINNED
2,2
5,2
6,2
4,1
5,1
8,1
2,3
3,3
*END LOAD CASE
*EL PRINT
S,
SINV,
E,
*NODE PRINT
U,RF
*END STEP