*HEADING
MISES PLASTICITY/LINEAR ELASTICITY, UNIAXIAL TENSION TEST, C3D8
*NODE,NSET=ALLN
*ELEMENT,TYPE=C3D8,ELSET=ALLE
*SOLID SECTION,ELSET=ALLE,MATERIAL=ALLE
*MATERIAL,NAME=ALLE
*ELASTIC
200.E3,.3
*PLASTIC
200.,0.
220.,.0009
220.,.0029
*BOUNDARY
1,PINNED
2,2
5,2
6,2
4,1
5,1
8,1
2,3
3,3
*STEP,INC=20
*STATIC,DIRECT
1.,20.
*BOUNDARY
7,3,,.004
5,3,,.004
6,3,,.004
8,3,,.004
*EL PRINT
S,
SINV,
E,
EP,
EE,
EEP,
PE,
PEP,
*NODE PRINT
U,RF
*EL FILE,FREQ=10
S,
E,EP
EE,EEP
PE,PEP
*END STEP