*HEADING
MISES PLASTICITY/LINEAR ELASTICITY, UNIAXIAL TENSION TEST, T3D2
*NODE,NSET=ALLN
*ELEMENT,TYPE=T3D2,ELSET=ALLE
*SOLID SECTION,ELSET=ALLE,MATERIAL=ALLE
1.,
*MATERIAL,NAME=ALLE
*ELASTIC
200.E3,.3
*PLASTIC
200.,0.
220.,.0009
220.,.0029
*BOUNDARY
1,PINNED
*STEP,INC=20
*STATIC,DIRECT
1.,20.
*BOUNDARY
2,1,,.004
*EL PRINT
S,
SINV,
E,
PE,
EE,
*NODE PRINT
U,RF
*EL FILE,FREQ=10
S,E,PE
*END STEP