*HEADING
*PREPRINT, MODEL=YES
*NODE,NSET=ALL
*NSET,NSET=FACE11
*NSET,NSET=FACE12
*NSET,NSET=FACE13
*NSET,NSET=FACE14
*NSET,NSET=FACE15
*NSET,NSET=FACE16
*NSET, NSET=NDISP1
*NSET, NSET=NGRP1
*ELEMENT,TYPE=C3D8R,ELSET=C3D
**
*ELSET, ELSET=EALL
 C3D
*SOLID SECTION,ELSET=EALL,MATERIAL=low_density_foam
 1.0,
*MATERIAL,NAME=low_density_foam
*DENSITY
 5.0000e-010,
*HYPERFOAM, N=3
-1048.43,0.3025,532.20,0.3958,517.027,0.2135,0.2,0.2,
0.2
*MULLINS EFFECT, TEST DATA INPUT
**1.75,0.3,0.6
*PLANAR TEST DATA
*PLANAR TEST DATA
*EQUATION
 FACE14,1,1,NDISP1,1,-1
*EQUATION
 NGRP1,3,1,NDISP1,3,-1
*NSET, NSET=NDISP
 NDISP1
*BOUNDARY
 FACE12,3
 NDISP1,3
 FACE13,2
 FACE16,1
*STEP,NLGEOM
 PLANAR LOADING
*STATIC
5.0e-4,1.0e-2,,5.0e-4
*BOUNDARY
 NDISP,1,1,0.5
*OUTPUT,FIELD, VARIABLE=PRESELECT
*OUTPUT, HISTORY, VARIABLE=PRESELECT
*ELEMENT OUTPUT, ELSET=EALL
 S11, LE11, NE11, ENER
*NODE OUT, NSET=NDISP
 RF1,RF3
*ENERGY OUTPUT
 ALLDMD
*NODE PRINT,NSET=NDISP
U1,RF1
*END STEP
*STEP,NLGEOM
 UNLOADING
*STATIC
5.0e-4,1.0e-2,,5.0e-4
*BOUNDARY,OP=NEW
 FACE12,3
 NDISP1,3
 FACE13,2
 FACE16,1
 NDISP,1,1,0.
*END STEP
*STEP,NLGEOM
 PLANAR LOADING
*STATIC
5.0e-4,1.0e-2,,5.0e-4
*BOUNDARY,OP=NEW
 FACE12,3
 NDISP1,3
 FACE13,2
 FACE16,1
 NDISP,1,1,1.0
*END STEP
*STEP,NLGEOM
 UNLOADING
*STATIC
5.0e-4,1.0e-2,,5.0e-4
*BOUNDARY,OP=NEW
 FACE12,3
 NDISP1,3
 FACE13,2
 FACE16,1
 NDISP,1,1,0.
*END STEP