*HEADING
 ADIABATIC MISES PLASTICITY, PURE SHEAR TEST, CPS4
*NODE,NSET=ALLN
*ELEMENT,TYPE=CPS4,ELSET=ALLE
*SOLID SECTION,ELSET=ALLE,MATERIAL=ALLE
 0.1,
*MATERIAL,NAME=ALLE
** IMAGINARY PROPERTIES
*ELASTIC
 30.E6,.3
*PLASTIC
 30.E3, 0.0
 50.E3, 0.2
 50.E3, 2.0
*DENSITY
 1000.,
*SPECIFIC HEAT
 0.4,
*INELASTIC HEAT FRACTION
*BOUNDARY
 1,PINNED
 2,PINNED
 3,2
 4,2
*STEP,INC=20
*STATIC,DIRECT,ADIABATIC
 1.,20.
*BOUNDARY
 3,1,,0.5
 4,1,,0.5
*EL PRINT
 S,
 SINV,
 E,
 PE,
 EE,
 MISES, PEEQ, TEMP, PENER
*NODE PRINT
 U,
 RF,
*EL FILE
 S,
 SINV,
 TEMP, ENER
*END STEP