*HEADING
 ADIABATIC MISES PLASTICITY, UNIAXIAL TENSION TEST, T3D2
*NODE,NSET=ALLN
*ELEMENT,TYPE=T3D2,ELSET=ALLE
*SOLID SECTION,ELSET=ALLE,MATERIAL=ALLE
*MATERIAL,NAME=ALLE
** IMAGINARY PROPERTIES
*ELASTIC
 30.E6,.3
*PLASTIC
 30.E3, 0.0
 50.E3, 0.2
 50.E3, 2.0
*DENSITY
 1000.,
*SPECIFIC HEAT
 0.4,
*INELASTIC HEAT FRACTION
*BOUNDARY
 1,PINNED
 2,2,6
*STEP,INC=20
*STATIC,DIRECT,ADIABATIC
 1.,20.
*BOUNDARY
 2,1,,.5
*EL PRINT
 S,
 SINV,
 E,
 PE,
 EE,
 MISES, PEEQ, TEMP, PENER
*NODE PRINT
 U,
 RF,
*OUTPUT,FIELD
*ELEMENT OUTPUT
S,
E,
TEMP,ENER
*END STEP